transformation-n
type: LexicalEntry
canonical form: transformation
sense: 00399512-n
part of speech: noun

translation-n
type: LexicalEntry
canonical form: translation
sense: 00399512-n
part of speech: noun

00399512-n
type: LexicalConcept
in scheme: en-word.net
definition: the act of changing in form or shape or appearance
example: a photograph is a translation of a scene onto a two-dimensional surface
ili: i37500
lexfile: noun.act
part of speech: noun
hypernym: 00376871-n