dull-v
type: LexicalEntry
canonical form: dull
sense: 00392673-v
part of speech: verb

00392673-v
type: LexicalConcept
in scheme: en-word.net
definition: become dull or lusterless in appearance; lose shine or brightness
example: the varnished table top dulled with time
ili: i23692
lexfile: verb.change
part of speech: verb
hypernym: 00109468-v