stifle-v
type: LexicalEntry
canonical form: stifle
sense: 00391513-v
part of speech: verb

dampen-v
type: LexicalEntry
canonical form: dampen
sense: 00391513-v
part of speech: verb

00391513-v
type: LexicalConcept
in scheme: en-word.net
definition: suppress or constrain so as to lessen in intensity
example: Stifle your curiosity
ili: i23685
lexfile: verb.change
part of speech: verb
hypernym: 02428558-v