invert-v
type: LexicalEntry
canonical form: invert
sense: 00387636-v
part of speech: verb

reverse-v
type: LexicalEntry
canonical form: reverse
sense: 00387636-v
part of speech: verb

00387636-v
type: LexicalConcept
in scheme: en-word.net
definition: reverse the position, order, relation, or condition of
example: when forming a question, invert the subject and the verb
ili: i23667
lexfile: verb.change
part of speech: verb
hypernym: 00660783-v