boil-v
type: LexicalEntry
canonical form: boil
sense: 00375692-v
part of speech: verb

00375692-v
type: LexicalConcept
in scheme: en-word.net
definition: come to the boiling point and change from a liquid to vapor
example: Water boils at 100 degrees Celsius
ili: i23610
lexfile: verb.change
part of speech: verb
hypernym: 00145958-v