decoct-v
type: LexicalEntry
canonical form: decoct
sense: 00375564-v
part of speech: verb

00375564-v
type: LexicalConcept
in scheme: en-word.net
definition: extract the essence of something by boiling it
ili: i23609
lexfile: verb.change
part of speech: verb
hypernym: 00375339-v