stretch-n
type: LexicalEntry
canonical form: stretch
sense: 00371867-n
part of speech: noun

00371867-n
type: LexicalConcept
in scheme: en-word.net
definition: extension to or beyond the ordinary limit
example: running at full stretch
example: by no stretch of the imagination
example: beyond any stretch of his understanding
ili: i37361
lexfile: noun.act
part of speech: noun
hypernym: 00368594-n