freeze-v
type: LexicalEntry
canonical form: freeze
sense: 00364146-v
part of speech: verb

suspend-v
type: LexicalEntry
canonical form: suspend
sense: 00364146-v
part of speech: verb

00364146-v
type: LexicalConcept
in scheme: en-word.net
definition: stop a process or a habit by imposing a freeze on it
example: Suspend the aid to the war-torn country
ili: i23553
lexfile: verb.change
part of speech: verb
hypernym: 00364717-v