close-v
type: LexicalEntry
canonical form: close
sense: 00352791-v
part of speech: verb

00352791-v
type: LexicalConcept
in scheme: en-word.net
definition: finish a game in baseball by protecting a lead
example: The relief pitcher closed with two runs in the second inning
ili: i23498
lexfile: verb.change
part of speech: verb
hypernym: 00485097-v