wave-n
type: LexicalEntry
canonical form: wave
sense: 00346921-n
part of speech: noun

00346921-n
type: LexicalConcept
in scheme: en-word.net
definition: a movement like that of a sudden occurrence or increase in a specified phenomenon
example: a wave of settlers
example: troops advancing in waves
ili: i37229
lexfile: noun.act
part of speech: noun
hypernym: 00332776-n