fatal-a
type: LexicalEntry
canonical form: fatal
sense: 00344124-s
part of speech: adjective

fateful-a
type: LexicalEntry
canonical form: fateful
sense: 00344124-s
part of speech: adjective

00344124-s
type: LexicalConcept
in scheme: en-word.net
definition: controlled or decreed by fate; predetermined
example: a fatal series of events
ili: i1903
lexfile: adj.all
part of speech: adjective satellite
similar: https://en-word.net/synset/00343913-a