supervene-v
type: LexicalEntry
canonical form: supervene
sense: 00342077-v
part of speech: verb

00342077-v
type: LexicalConcept
in scheme: en-word.net
definition: take place as an additional or unexpected development
ili: i23441
lexfile: verb.change
part of speech: verb
hypernym: 00340744-v