intervene-v
type: LexicalEntry
canonical form: intervene
sense: 00341638-v
part of speech: verb

00341638-v
type: LexicalConcept
in scheme: en-word.net
definition: occur between other event or between certain points of time
example: the war intervened between the birth of her two children
ili: i23437
lexfile: verb.change
part of speech: verb
hypernym: 00340744-v