saccade-n
type: LexicalEntry
canonical form: saccade
sense: 00339097-n
part of speech: noun

00339097-n
type: LexicalConcept
in scheme: en-word.net
definition: a rapid, jerky movement of the eyes between positions of rest
ili: i37187
lexfile: noun.act
part of speech: noun
hypernym: 00338312-n