bob-n
type: LexicalEntry
canonical form: bob
sense: 00337100-n
part of speech: noun

00337100-n
type: LexicalConcept
in scheme: en-word.net
definition: a short abrupt inclination (as of the head)
example: he gave me a short bob of acknowledgement
ili: i37176
lexfile: noun.act
part of speech: noun
hypernym: 00336210-n