pound-v
type: LexicalEntry
canonical form: pound
sense: 00332324-v
part of speech: verb

00332324-v
type: LexicalConcept
in scheme: en-word.net
definition: break down and crush by beating, as with a pestle
example: pound the roots with a heavy flat stone
ili: i23391
lexfile: verb.change
part of speech: verb
hypernym: 00338881-v