heave-n
type: LexicalEntry
canonical form: heave
sense: 00325660-n
part of speech: noun

heaving-n
type: LexicalEntry
canonical form: heaving
sense: 00325660-n
part of speech: noun

00325660-n
type: LexicalConcept
in scheme: en-word.net
definition: the act of lifting something with great effort
ili: i37119
lexfile: noun.act
part of speech: noun
hypernym: 00325210-n