stew-v
type: LexicalEntry
canonical form: stew
sense: 00324657-v
part of speech: verb

00324657-v
type: LexicalConcept
in scheme: en-word.net
definition: cook slowly and for a long time in liquid
example: Stew the vegetables in wine
ili: i23351
lexfile: verb.change
part of speech: verb
domain topic: 00244785-n
hypernym: 00323648-v