fix-n
type: LexicalEntry
canonical form: fix
sense: 00324088-n
part of speech: noun

00324088-n
type: LexicalConcept
in scheme: en-word.net
definition: something craved, especially an intravenous injection of a narcotic drug
example: she needed a fix of chocolate
ili: i37110
lexfile: noun.act
part of speech: noun
exemplifies: 07089193-n
hypernym: 00323978-n