connection-n
type: LexicalEntry
canonical form: connection
sense: 00317815-n
part of speech: noun

connexion-n
type: LexicalEntry
canonical form: connexion
sense: 00317815-n
part of speech: noun

00317815-n
type: LexicalConcept
in scheme: en-word.net
definition: shifting from one form of transportation to another
example: the plane was late and he missed his connection in Atlanta
ili: i37075
lexfile: noun.act
part of speech: noun
hypernym: 00316812-n