luxuriate-v
type: LexicalEntry
canonical form: luxuriate
sense: 00311594-v
part of speech: verb

00311594-v
type: LexicalConcept
in scheme: en-word.net
definition: thrive profusely or flourish extensively
ili: i23279
lexfile: verb.change
part of speech: verb
hypernym: 00311168-v