pop-v
type: LexicalEntry
canonical form: pop
sense: 00310574-v
part of speech: verb

00310574-v
type: LexicalConcept
in scheme: en-word.net
definition: cause to burst with a loud, explosive sound
example: The child popped the balloon
ili: i23273
lexfile: verb.change
part of speech: verb
hypernym: 01993576-v
similar: 00310364-v