trip-n
type: LexicalEntry
canonical form: trip
sense: 00309196-n
part of speech: noun

00309196-n
type: LexicalConcept
in scheme: en-word.net
definition: a journey for some purpose (usually including the return)
example: he took a trip to the shopping center
ili: i37024
lexfile: noun.act
part of speech: noun
hypernym: 00307252-n