journey-n
type: LexicalEntry
canonical form: journey
sense: 00307252-n
part of speech: noun

journeying-n
type: LexicalEntry
canonical form: journeying
sense: 00307252-n
part of speech: noun

00307252-n
type: LexicalConcept
in scheme: en-word.net
definition: the act of traveling from one place to another
ili: i37014
lexfile: noun.act
part of speech: noun
hypernym: 00296527-n
mero part: 00307726-n