tailspin-n
type: LexicalEntry
canonical form: tailspin
sense: 00307036-n
part of speech: noun

spin-n
type: LexicalEntry
canonical form: spin
sense: 00307036-n
part of speech: noun

00307036-n
type: LexicalConcept
in scheme: en-word.net
definition: rapid descent of an aircraft in a steep spiral
ili: i37012
lexfile: noun.act
part of speech: noun
hypernym: 00303687-n