sortie-n
type: LexicalEntry
canonical form: sortie
sense: 00305677-n
part of speech: noun

00305677-n
type: LexicalConcept
in scheme: en-word.net
definition: (military) an operational flight by a single aircraft (as in a military operation)
ili: i37003
lexfile: noun.act
part of speech: noun
domain topic: 08215965-n
hypernym: 00303220-n