widen-v
type: LexicalEntry
canonical form: widen
sense: 00304246-v
part of speech: verb

00304246-v
type: LexicalConcept
in scheme: en-word.net
definition: become broader or wider or more extensive
example: The road widened
ili: i23241
lexfile: verb.change
part of speech: verb
hypernym: 00156409-v