plodding-n
type: LexicalEntry
canonical form: plodding
sense: 00292809-n
part of speech: noun

plod-n
type: LexicalEntry
canonical form: plod
sense: 00292809-n
part of speech: noun

00292809-n
type: LexicalConcept
in scheme: en-word.net
definition: the act of walking with a slow heavy gait
example: I could recognize his plod anywhere
ili: i36933
lexfile: noun.act
part of speech: noun
hypernym: 00284412-n