halting-a
type: LexicalEntry
canonical form: halting
sense: 00291650-s
part of speech: adjective

00291650-s
type: LexicalConcept
in scheme: en-word.net
definition: fragmentary or halting from emotional strain
example: uttered a few halting words of sorrow
ili: i1613
lexfile: adj.all
part of speech: adjective satellite
similar: https://en-word.net/synset/00290849-a