redouble-v
type: LexicalEntry
canonical form: redouble
sense: 00291343-v
part of speech: verb

00291343-v
type: LexicalConcept
in scheme: en-word.net
definition: double in magnitude, extent, or intensity
example: The enemy redoubled their screaming on the radio
ili: i23179
lexfile: verb.change
part of speech: verb
hypernym: 00291064-v