trot-n
type: LexicalEntry
canonical form: trot
sense: 00288405-n
part of speech: noun

00288405-n
type: LexicalConcept
in scheme: en-word.net
definition: a gait faster than a walk; diagonally opposite legs strike the ground together
ili: i36904
lexfile: noun.act
part of speech: noun
hypernym: 00287801-n