smut-v
type: LexicalEntry
canonical form: smut
sense: 00287558-v
part of speech: verb

00287558-v
type: LexicalConcept
in scheme: en-word.net
definition: stain with a dirty substance, such as soot
ili: i23154
lexfile: verb.change
part of speech: verb
hypernym: 00287365-v