lurid-a
type: LexicalEntry
canonical form: lurid
sense: 00283255-s
part of speech: adjective

00283255-s
type: LexicalConcept
in scheme: en-word.net
definition: shining with an unnatural red glow as of fire seen through smoke
example: a lurid sunset
example: lurid flames
ili: i1570
lexfile: adj.all
part of speech: adjective satellite
similar: https://en-word.net/synset/00279417-a