movement-n
type: LexicalEntry
canonical form: movement
sense: 00281430-n
part of speech: noun

00281430-n
type: LexicalConcept
in scheme: en-word.net
definition: the act of changing the location of something
example: the movement of cargo onto the vessel
ili: i36870
lexfile: noun.act
part of speech: noun
hypernym: 00191991-n