splash-n
type: LexicalEntry
canonical form: splash
sense: 00279065-n
part of speech: noun

splashing-n
type: LexicalEntry
canonical form: splashing
sense: 00279065-n
part of speech: noun

00279065-n
type: LexicalConcept
in scheme: en-word.net
definition: the act of scattering water about haphazardly
ili: i36860
lexfile: noun.act
part of speech: noun
hypernym: 00278220-n