staining-n
type: LexicalEntry
canonical form: staining
sense: 00276416-n
part of speech: noun

00276416-n
type: LexicalConcept
in scheme: en-word.net
definition: (histology) the use of a dye to color specimens for microscopic study
ili: i36848
lexfile: noun.act
part of speech: noun
domain topic: 06086963-n
hypernym: 00276268-n