habituate-v
type: LexicalEntry
canonical form: habituate
sense: 00274244-v
part of speech: verb

accustom-v
type: LexicalEntry
canonical form: accustom
sense: 00274244-v
part of speech: verb

00274244-v
type: LexicalConcept
in scheme: en-word.net
definition: make psychologically or physically used (to something)
example: She became habituated to the background music
ili: i23086
lexfile: verb.change
part of speech: verb
hypernym: 00126072-v