engagement-n
type: LexicalEntry
canonical form: engagement
sense: 00271763-n
part of speech: noun

booking-n
type: LexicalEntry
canonical form: booking
sense: 00271763-n
part of speech: noun

00271763-n
type: LexicalConcept
in scheme: en-word.net
definition: employment for performers or performing groups that lasts for a limited period of time
example: the play had bookings throughout the summer
ili: i36823
lexfile: noun.act
part of speech: noun
hypernym: 00585404-n