restoration-n
type: LexicalEntry
canonical form: restoration
sense: 00269401-n
part of speech: noun

00269401-n
type: LexicalConcept
in scheme: en-word.net
definition: the act of restoring something or someone to a satisfactory state
ili: i36809
lexfile: noun.act
part of speech: noun
hypernym: 00267650-n