reform-v
type: LexicalEntry
canonical form: reform
sense: 00266272-v
part of speech: verb

00266272-v
type: LexicalConcept
in scheme: en-word.net
definition: make changes for improvement in order to remove abuse and injustices
example: reform a political system
ili: i23044
lexfile: verb.change
part of speech: verb
hypernym: 00206293-v
similar: 00266559-v