deflate-v
type: LexicalEntry
canonical form: deflate
sense: 00265591-v
part of speech: verb

00265591-v
type: LexicalConcept
in scheme: en-word.net
definition: become deflated or flaccid, as by losing air
example: The balloons deflated
ili: i23041
lexfile: verb.change
part of speech: verb
hypernym: 00151509-v