decoration-n
type: LexicalEntry
canonical form: decoration
sense: 00263092-n
part of speech: noun

00263092-n
type: LexicalConcept
in scheme: en-word.net
definition: the act of decorating something (in the hope of making it more attractive)
ili: i36772
lexfile: noun.act
part of speech: noun
hypernym: 00199979-n