indemnification-n
type: LexicalEntry
canonical form: indemnification
sense: 00260737-n
part of speech: noun

00260737-n
type: LexicalConcept
in scheme: en-word.net
definition: an act of compensation for actual loss or damage or for trouble and annoyance
ili: i36761
lexfile: noun.act
part of speech: noun
hypernym: 00260486-n