derive-v
type: LexicalEntry
canonical form: derive
sense: 00252501-v
part of speech: verb

educe-v
type: LexicalEntry
canonical form: educe
sense: 00252501-v
part of speech: verb

00252501-v
type: LexicalConcept
in scheme: en-word.net
definition: develop or evolve from a latent or potential state
ili: i22976
lexfile: verb.change
part of speech: verb
hypernym: 01620211-v