infusion-n
type: LexicalEntry
canonical form: infusion
sense: 00249615-n
part of speech: noun

00249615-n
type: LexicalConcept
in scheme: en-word.net
definition: the act of infusing or introducing a certain modifying element or quality
example: the team's continued success is attributable to a steady infusion of new talent
ili: i36701
lexfile: noun.act
part of speech: noun
hypernym: 00199979-n