black-a
type: LexicalEntry
canonical form: black
sense: https://en-word.net/lemma/black-a#00243558-a
part of speech: adjective

https://en-word.net/synset/00243558-a
type: LexicalConcept
in scheme: en-word.net
definition: of or belonging to a racial group especially of sub-Saharan African origin
example: a great people — a black people — … injected new meaning and dignity into the veins of civilization
  source: Martin Luther King Jr.
ili: i1349
lexfile: adj.all
part of speech: adjective
similar: 00243846-s
similar: 00244035-s