inauguration-n
type: LexicalEntry
canonical form: inauguration
sense: 00240777-n
part of speech: noun

startup-n
type: LexicalEntry
canonical form: startup
sense: 00240777-n
part of speech: noun

00240777-n
type: LexicalConcept
in scheme: en-word.net
definition: the act of starting a new operation or practice
example: he opposed the inauguration of fluoridation
example: the startup of the new factory was delayed by strikes
ili: i36665
lexfile: noun.act
part of speech: noun
hypernym: 00236302-n