fade-v
type: LexicalEntry
canonical form: fade
sense: 00225077-v
part of speech: verb

melt-v
type: LexicalEntry
canonical form: melt
sense: 00225077-v
part of speech: verb

00225077-v
type: LexicalConcept
in scheme: en-word.net
definition: become less clearly visible or distinguishable; disappear gradually or seemingly
example: The scene begins to fade
example: The tree trunks are melting into the forest at dusk
ili: i22846
lexfile: verb.change
part of speech: verb
hypernym: 00223926-v