bloodshed-n
type: LexicalEntry
canonical form: bloodshed
sense: 00222045-n
part of speech: noun

gore-n
type: LexicalEntry
canonical form: gore
sense: 00222045-n
part of speech: noun

00222045-n
type: LexicalConcept
in scheme: en-word.net
definition: the shedding of blood resulting in murder
example: he avenged the bloodshed of his kinsmen
ili: i36564
lexfile: noun.act
part of speech: noun
hypernym: 00221389-n