overthrow-n
type: LexicalEntry
canonical form: overthrow
sense: 00216550-n
part of speech: noun

00216550-n
type: LexicalConcept
in scheme: en-word.net
definition: the termination of a ruler or institution (especially by force)
ili: i36537
lexfile: noun.act
part of speech: noun
hypernym: 00210792-n